Uploaded image for project: 'Gradle Artifactory Plug-in'
  1. Gradle Artifactory Plug-in
  2. GAP-293

artifactoryPublish task seems to not be respecting altering of publications

    XMLWordPrintable

    Details

    • Type: Bug
    • Status: Open
    • Resolution: Unresolved
    • Affects Version/s: 4.4.10, 4.4.11, 4.4.12, 4.4.13, 4.4.14, 4.4.15, 4.4.18, 4.5.0, 4.5.1, 4.5.2, 4.6.0, 4.7.0, 4.7.1, 4.7.2, 4.7.3, 4.7.4
    • Fix Version/s: None
    • Labels:

      Description

      Follow-up to GAP-289 & also posted to https://github.com/jfrog/build-info/issues/171

      After upgrading I'm seeing some strange behavior that I have replicated in a sample project for you (https://github.com/edeandrea/artifactory-publish-sample).

      Essentially I have 2 different plugins (JavaPlugin & WarPlugin. The JavaPlugin sets up a publication assuming you are publishing a Spring Boot jar file whereas WarPlugin sets up a publication assuming you are publishing a Spring Boot war file. The WarPlugin then has to remove the publication that the JavaPlugin introduced.

      This worked fine in version 4.4.9 but after upgrading to 4.7.3 (& subsequently 4.7.4) this stopped working.

      When I run the Gradle `tasks` task, I see the correct set of tasks (i.e. I see the `generatePomFileForMainWarPublication` task as expected and don't see the `generatePomFileForMainJavaPublication` task):

      Gradle tasks output

       

      9:37:47 AM: Executing task 'tasks'...
      :buildSrc:compileJava NO-SOURCE
      :buildSrc:compileGroovy UP-TO-DATE
      :buildSrc:processResources NO-SOURCE
      :buildSrc:classes UP-TO-DATE
      :buildSrc:jar UP-TO-DATE
      :buildSrc:assemble UP-TO-DATE
      :buildSrc:compileTestJava NO-SOURCE
      :buildSrc:compileTestGroovy NO-SOURCE
      :buildSrc:processTestResources NO-SOURCE
      :buildSrc:testClasses UP-TO-DATE
      :buildSrc:test NO-SOURCE
      :buildSrc:check UP-TO-DATE
      :buildSrc:build UP-TO-DATE
      :tasks
      ------------------------------------------------------------
      All tasks runnable from root project
      ------------------------------------------------------------
      Application tasks
      -----------------
      bootRun - Runs this project as a Spring Boot application.
      Build tasks
      -----------
      assemble - Assembles the outputs of this project.
      bootJar - Assembles an executable jar archive containing the main classes and their dependencies.
      bootWar - Assembles an executable war archive containing webapp content, and the main classes and their dependencies.
      build - Assembles and tests this project.
      buildDependents - Assembles and tests this project and all projects that depend on it.
      buildNeeded - Assembles and tests this project and all projects it depends on.
      classes - Assembles main classes.
      clean - Deletes the build directory.
      jar - Assembles a jar archive containing the main classes.
      testClasses - Assembles test classes.
      war - Generates a war archive with all the compiled classes, the web-app content and the libraries.
      Build Setup tasks
      -----------------
      init - Initializes a new Gradle build.
      wrapper - Generates Gradle wrapper files.
      Documentation tasks
      -------------------
      javadoc - Generates Javadoc API documentation for the main source code.
      Help tasks
      ----------
      buildEnvironment - Displays all buildscript dependencies declared in root project 'artifactory-publish-sample'.
      components - Displays the components produced by root project 'artifactory-publish-sample'. [incubating]
      dependencies - Displays all dependencies declared in root project 'artifactory-publish-sample'.
      dependencyInsight - Displays the insight into a specific dependency in root project 'artifactory-publish-sample'.
      dependencyManagement - Displays the dependency management declared in root project 'artifactory-publish-sample'.
      dependentComponents - Displays the dependent components of components in root project 'artifactory-publish-sample'. [incubating]
      help - Displays a help message.
      model - Displays the configuration model of root project 'artifactory-publish-sample'. [incubating]
      projects - Displays the sub-projects of root project 'artifactory-publish-sample'.
      properties - Displays the properties of root project 'artifactory-publish-sample'.
      tasks - Displays the tasks runnable from root project 'artifactory-publish-sample'.
      IDE tasks
      ---------
      cleanEclipse - Cleans all Eclipse files.
      cleanEclipseWtp - Cleans Eclipse wtp configuration files.
      cleanIdea - Cleans IDEA project files (IML, IPR)
      eclipse - Generates all Eclipse files.
      eclipseWtp - Generates Eclipse wtp configuration files.
      idea - Generates IDEA project files (IML, IPR, IWS)
      Publishing tasks
      ----------------
      artifactoryDeploy - Deploys artifacts and build-info to Artifactory
      artifactoryPublish - AddS artifacts and generates build-info to be later deployed to Artifactory,
      generatePomFileForMainWarPublication - Generates the Maven POM file for publication 'mainWar'.
      publish - Publishes all publications produced by this project.
      publishMainWarPublicationToMavenLocal - Publishes Maven publication 'mainWar' to the local Maven repository.
      publishToMavenLocal - Publishes all Maven publications produced by this project to the local Maven cache.
      Verification tasks
      ------------------
      check - Runs all checks.
      test - Runs the unit tests.
      Rules
      -----
      Pattern: clean<TaskName>: Cleans the output files of a task.
      Pattern: build<ConfigurationName>: Assembles the artifacts of a configuration.
      Pattern: upload<ConfigurationName>: Assembles and uploads the artifacts belonging to a configuration.
      To see all tasks and more detail, run gradle tasks --all
      To see more detail about a task, run gradle help --task <task>
      BUILD SUCCESSFUL in 4s
      1 actionable task: 1 executed
      9:37:52 AM: Task execution finished 'tasks'.
      

       

      Build output:

      :buildSrc:compileJava NO-SOURCE
      :buildSrc:compileGroovy UP-TO-DATE
      :buildSrc:processResources NO-SOURCE
      :buildSrc:classes UP-TO-DATE
      :buildSrc:jar UP-TO-DATE
      :buildSrc:assemble UP-TO-DATE
      :buildSrc:compileTestJava NO-SOURCE
      :buildSrc:compileTestGroovy NO-SOURCE
      :buildSrc:processTestResources NO-SOURCE
      :buildSrc:testClasses UP-TO-DATE
      :buildSrc:test NO-SOURCE
      :buildSrc:check UP-TO-DATE
      :buildSrc:build UP-TO-DATE
      FAILURE: Build failed with an exception.
      * What went wrong:
      Could not determine the dependencies of task ':artifactoryPublish'.
      > Task with path '::generatePomFileForMainJavaPublication' not found in root project 'artifactory-publish-sample'.
      * Try:
      Run with --info or --debug option to get more log output. Run with --scan to get full insights.
      * Exception is:
      org.gradle.api.internal.tasks.TaskDependencyResolveException: Could not determine the dependencies of task ':artifactoryPublish'.
       at org.gradle.api.internal.tasks.CachingTaskDependencyResolveContext.getDependencies(CachingTaskDependencyResolveContext.java:62)
       at org.gradle.execution.taskgraph.DefaultTaskExecutionPlan.addToTaskGraph(DefaultTaskExecutionPlan.java:179)
       at org.gradle.execution.taskgraph.DefaultTaskGraphExecuter.addTasks(DefaultTaskGraphExecuter.java:113)
       at org.gradle.execution.TaskNameResolvingBuildConfigurationAction.configure(TaskNameResolvingBuildConfigurationAction.java:47)
       at org.gradle.execution.DefaultBuildConfigurationActionExecuter.configure(DefaultBuildConfigurationActionExecuter.java:48)
       at org.gradle.execution.DefaultBuildConfigurationActionExecuter.access$000(DefaultBuildConfigurationActionExecuter.java:25)
       at org.gradle.execution.DefaultBuildConfigurationActionExecuter$1.proceed(DefaultBuildConfigurationActionExecuter.java:54)
       at org.gradle.execution.DefaultTasksBuildExecutionAction.configure(DefaultTasksBuildExecutionAction.java:44)
       at org.gradle.execution.DefaultBuildConfigurationActionExecuter.configure(DefaultBuildConfigurationActionExecuter.java:48)
       at org.gradle.execution.DefaultBuildConfigurationActionExecuter.access$000(DefaultBuildConfigurationActionExecuter.java:25)
       at org.gradle.execution.DefaultBuildConfigurationActionExecuter$1.proceed(DefaultBuildConfigurationActionExecuter.java:54)
       at org.gradle.execution.ExcludedTaskFilteringBuildConfigurationAction.configure(ExcludedTaskFilteringBuildConfigurationAction.java:47)
       at org.gradle.execution.DefaultBuildConfigurationActionExecuter.configure(DefaultBuildConfigurationActionExecuter.java:48)
       at org.gradle.execution.DefaultBuildConfigurationActionExecuter.select(DefaultBuildConfigurationActionExecuter.java:36)
       at org.gradle.initialization.DefaultGradleLauncher$CalculateTaskGraph.run(DefaultGradleLauncher.java:286)
       at org.gradle.internal.progress.DefaultBuildOperationExecutor$RunnableBuildOperationWorker.execute(DefaultBuildOperationExecutor.java:336)
       at org.gradle.internal.progress.DefaultBuildOperationExecutor$RunnableBuildOperationWorker.execute(DefaultBuildOperationExecutor.java:328)
       at org.gradle.internal.progress.DefaultBuildOperationExecutor.execute(DefaultBuildOperationExecutor.java:199)
       at org.gradle.internal.progress.DefaultBuildOperationExecutor.run(DefaultBuildOperationExecutor.java:110)
       at org.gradle.initialization.DefaultGradleLauncher.constructTaskGraph(DefaultGradleLauncher.java:181)
       at org.gradle.initialization.DefaultGradleLauncher.doBuildStages(DefaultGradleLauncher.java:136)
       at org.gradle.initialization.DefaultGradleLauncher.executeTasks(DefaultGradleLauncher.java:115)
       at org.gradle.internal.invocation.GradleBuildController$1.call(GradleBuildController.java:78)
       at org.gradle.internal.invocation.GradleBuildController$1.call(GradleBuildController.java:75)
       at org.gradle.internal.work.DefaultWorkerLeaseService.withLocks(DefaultWorkerLeaseService.java:152)
       at org.gradle.internal.invocation.GradleBuildController.doBuild(GradleBuildController.java:100)
       at org.gradle.internal.invocation.GradleBuildController.run(GradleBuildController.java:75)
       at org.gradle.tooling.internal.provider.ExecuteBuildActionRunner.run(ExecuteBuildActionRunner.java:28)
       at org.gradle.launcher.exec.ChainingBuildActionRunner.run(ChainingBuildActionRunner.java:35)
       at org.gradle.tooling.internal.provider.ValidatingBuildActionRunner.run(ValidatingBuildActionRunner.java:32)
       at org.gradle.launcher.exec.RunAsBuildOperationBuildActionRunner$1.run(RunAsBuildOperationBuildActionRunner.java:43)
       at org.gradle.internal.progress.DefaultBuildOperationExecutor$RunnableBuildOperationWorker.execute(DefaultBuildOperationExecutor.java:336)
       at org.gradle.internal.progress.DefaultBuildOperationExecutor$RunnableBuildOperationWorker.execute(DefaultBuildOperationExecutor.java:328)
       at org.gradle.internal.progress.DefaultBuildOperationExecutor.execute(DefaultBuildOperationExecutor.java:199)
       at org.gradle.internal.progress.DefaultBuildOperationExecutor.run(DefaultBuildOperationExecutor.java:110)
       at org.gradle.launcher.exec.RunAsBuildOperationBuildActionRunner.run(RunAsBuildOperationBuildActionRunner.java:40)
       at org.gradle.tooling.internal.provider.SubscribableBuildActionRunner.run(SubscribableBuildActionRunner.java:51)
       at org.gradle.launcher.exec.InProcessBuildActionExecuter.execute(InProcessBuildActionExecuter.java:49)
       at org.gradle.launcher.exec.InProcessBuildActionExecuter.execute(InProcessBuildActionExecuter.java:32)
       at org.gradle.launcher.exec.BuildTreeScopeBuildActionExecuter.execute(BuildTreeScopeBuildActionExecuter.java:39)
       at org.gradle.launcher.exec.BuildTreeScopeBuildActionExecuter.execute(BuildTreeScopeBuildActionExecuter.java:25)
       at org.gradle.tooling.internal.provider.ContinuousBuildActionExecuter.execute(ContinuousBuildActionExecuter.java:80)
       at org.gradle.tooling.internal.provider.ContinuousBuildActionExecuter.execute(ContinuousBuildActionExecuter.java:53)
       at org.gradle.tooling.internal.provider.ServicesSetupBuildActionExecuter.execute(ServicesSetupBuildActionExecuter.java:57)
       at org.gradle.tooling.internal.provider.ServicesSetupBuildActionExecuter.execute(ServicesSetupBuildActionExecuter.java:32)
       at org.gradle.tooling.internal.provider.GradleThreadBuildActionExecuter.execute(GradleThreadBuildActionExecuter.java:36)
       at org.gradle.tooling.internal.provider.GradleThreadBuildActionExecuter.execute(GradleThreadBuildActionExecuter.java:25)
       at org.gradle.tooling.internal.provider.ParallelismConfigurationBuildActionExecuter.execute(ParallelismConfigurationBuildActionExecuter.java:43)
       at org.gradle.tooling.internal.provider.ParallelismConfigurationBuildActionExecuter.execute(ParallelismConfigurationBuildActionExecuter.java:29)
       at org.gradle.tooling.internal.provider.StartParamsValidatingActionExecuter.execute(StartParamsValidatingActionExecuter.java:64)
       at org.gradle.tooling.internal.provider.StartParamsValidatingActionExecuter.execute(StartParamsValidatingActionExecuter.java:29)
       at org.gradle.tooling.internal.provider.SessionFailureReportingActionExecuter.execute(SessionFailureReportingActionExecuter.java:59)
       at org.gradle.tooling.internal.provider.SessionFailureReportingActionExecuter.execute(SessionFailureReportingActionExecuter.java:44)
       at org.gradle.tooling.internal.provider.SetupLoggingActionExecuter.execute(SetupLoggingActionExecuter.java:45)
       at org.gradle.tooling.internal.provider.SetupLoggingActionExecuter.execute(SetupLoggingActionExecuter.java:30)
       at org.gradle.launcher.daemon.server.exec.ExecuteBuild.doBuild(ExecuteBuild.java:67)
       at org.gradle.launcher.daemon.server.exec.BuildCommandOnly.execute(BuildCommandOnly.java:36)
       at org.gradle.launcher.daemon.server.api.DaemonCommandExecution.proceed(DaemonCommandExecution.java:122)
       at org.gradle.launcher.daemon.server.exec.WatchForDisconnection.execute(WatchForDisconnection.java:37)
       at org.gradle.launcher.daemon.server.api.DaemonCommandExecution.proceed(DaemonCommandExecution.java:122)
       at org.gradle.launcher.daemon.server.exec.ResetDeprecationLogger.execute(ResetDeprecationLogger.java:26)
       at org.gradle.launcher.daemon.server.api.DaemonCommandExecution.proceed(DaemonCommandExecution.java:122)
       at org.gradle.launcher.daemon.server.exec.RequestStopIfSingleUsedDaemon.execute(RequestStopIfSingleUsedDaemon.java:34)
       at org.gradle.launcher.daemon.server.api.DaemonCommandExecution.proceed(DaemonCommandExecution.java:122)
       at org.gradle.launcher.daemon.server.exec.ForwardClientInput$2.call(ForwardClientInput.java:74)
       at org.gradle.launcher.daemon.server.exec.ForwardClientInput$2.call(ForwardClientInput.java:72)
       at org.gradle.util.Swapper.swap(Swapper.java:38)
       at org.gradle.launcher.daemon.server.exec.ForwardClientInput.execute(ForwardClientInput.java:72)
       at org.gradle.launcher.daemon.server.api.DaemonCommandExecution.proceed(DaemonCommandExecution.java:122)
       at org.gradle.launcher.daemon.server.exec.LogAndCheckHealth.execute(LogAndCheckHealth.java:55)
       at org.gradle.launcher.daemon.server.api.DaemonCommandExecution.proceed(DaemonCommandExecution.java:122)
       at org.gradle.launcher.daemon.server.exec.LogToClient.doBuild(LogToClient.java:62)
       at org.gradle.launcher.daemon.server.exec.BuildCommandOnly.execute(BuildCommandOnly.java:36)
       at org.gradle.launcher.daemon.server.api.DaemonCommandExecution.proceed(DaemonCommandExecution.java:122)
       at org.gradle.launcher.daemon.server.exec.EstablishBuildEnvironment.doBuild(EstablishBuildEnvironment.java:82)
       at org.gradle.launcher.daemon.server.exec.BuildCommandOnly.execute(BuildCommandOnly.java:36)
       at org.gradle.launcher.daemon.server.api.DaemonCommandExecution.proceed(DaemonCommandExecution.java:122)
       at org.gradle.launcher.daemon.server.exec.StartBuildOrRespondWithBusy$1.run(StartBuildOrRespondWithBusy.java:50)
       at org.gradle.launcher.daemon.server.DaemonStateCoordinator$1.run(DaemonStateCoordinator.java:295)
       at org.gradle.internal.concurrent.ExecutorPolicy$CatchAndRecordFailures.onExecute(ExecutorPolicy.java:63)
       at org.gradle.internal.concurrent.ManagedExecutorImpl$1.run(ManagedExecutorImpl.java:46)
       at org.gradle.internal.concurrent.ThreadFactoryImpl$ManagedThreadRunnable.run(ThreadFactoryImpl.java:55)
      Caused by: org.gradle.api.UnknownTaskException: Task with path '::generatePomFileForMainJavaPublication' not found in root project 'artifactory-publish-sample'.
       at org.gradle.api.internal.tasks.DefaultTaskContainer.getByPath(DefaultTaskContainer.java:200)
       at org.gradle.api.internal.tasks.DefaultTaskContainer.resolveTask(DefaultTaskContainer.java:182)
       at org.gradle.api.internal.tasks.DefaultTaskDependency.visitDependencies(DefaultTaskDependency.java:128)
       at org.gradle.api.internal.tasks.CachingTaskDependencyResolveContext$TaskGraphImpl.getNodeValues(CachingTaskDependencyResolveContext.java:89)
       at org.gradle.internal.graph.CachingDirectedGraphWalker$GraphWithEmpyEdges.getNodeValues(CachingDirectedGraphWalker.java:211)
       at org.gradle.internal.graph.CachingDirectedGraphWalker.doSearch(CachingDirectedGraphWalker.java:121)
       at org.gradle.internal.graph.CachingDirectedGraphWalker.findValues(CachingDirectedGraphWalker.java:73)
       at org.gradle.api.internal.tasks.CachingTaskDependencyResolveContext.doGetDependencies(CachingTaskDependencyResolveContext.java:76)
       at org.gradle.api.internal.tasks.CachingTaskDependencyResolveContext.getDependencies(CachingTaskDependencyResolveContext.java:60)
       ... 81 more
      
      * Get more help at https://help.gradle.org
      BUILD FAILED in 0s
      

       

      Seems now version `4.4.9` of the plugin is not compatible with Gradle `4.8`. When the `artifactoryPublish` task runs it errors out with the below error. We're not stuck on Gradle version 4.6.

      
      org.gradle.api.tasks.TaskExecutionException: Execution failed for task ':artifactoryPublish'.
       at org.gradle.api.internal.tasks.execution.ExecuteActionsTaskExecuter.executeActions(ExecuteActionsTaskExecuter.java:110)
       at org.gradle.api.internal.tasks.execution.ExecuteActionsTaskExecuter.execute(ExecuteActionsTaskExecuter.java:77)
       at org.gradle.api.internal.tasks.execution.OutputDirectoryCreatingTaskExecuter.execute(OutputDirectoryCreatingTaskExecuter.java:51)
       at org.gradle.api.internal.tasks.execution.SkipUpToDateTaskExecuter.execute(SkipUpToDateTaskExecuter.java:59)
       at org.gradle.api.internal.tasks.execution.ResolveTaskOutputCachingStateExecuter.execute(ResolveTaskOutputCachingStateExecuter.java:54)
       at org.gradle.api.internal.tasks.execution.ResolveBuildCacheKeyExecuter.execute(ResolveBuildCacheKeyExecuter.java:66)
       at org.gradle.api.internal.tasks.execution.ValidatingTaskExecuter.execute(ValidatingTaskExecuter.java:59)
       at org.gradle.api.internal.tasks.execution.SkipEmptySourceFilesTaskExecuter.execute(SkipEmptySourceFilesTaskExecuter.java:101)
       at org.gradle.api.internal.tasks.execution.FinalizeInputFilePropertiesTaskExecuter.execute(FinalizeInputFilePropertiesTaskExecuter.java:44)
       at org.gradle.api.internal.tasks.execution.CleanupStaleOutputsExecuter.execute(CleanupStaleOutputsExecuter.java:91)
       at org.gradle.api.internal.tasks.execution.ResolveTaskArtifactStateTaskExecuter.execute(ResolveTaskArtifactStateTaskExecuter.java:62)
       at org.gradle.api.internal.tasks.execution.SkipTaskWithNoActionsExecuter.execute(SkipTaskWithNoActionsExecuter.java:59)
       at org.gradle.api.internal.tasks.execution.SkipOnlyIfTaskExecuter.execute(SkipOnlyIfTaskExecuter.java:54)
       at org.gradle.api.internal.tasks.execution.ExecuteAtMostOnceTaskExecuter.execute(ExecuteAtMostOnceTaskExecuter.java:43)
       at org.gradle.api.internal.tasks.execution.CatchExceptionTaskExecuter.execute(CatchExceptionTaskExecuter.java:34)
       at org.gradle.api.internal.tasks.execution.EventFiringTaskExecuter$1.run(EventFiringTaskExecuter.java:51)
       at org.gradle.internal.operations.DefaultBuildOperationExecutor$RunnableBuildOperationWorker.execute(DefaultBuildOperationExecutor.java:317)
       at org.gradle.internal.operations.DefaultBuildOperationExecutor$RunnableBuildOperationWorker.execute(DefaultBuildOperationExecutor.java:309)
       at org.gradle.internal.operations.DefaultBuildOperationExecutor.execute(DefaultBuildOperationExecutor.java:185)
       at org.gradle.internal.operations.DefaultBuildOperationExecutor.run(DefaultBuildOperationExecutor.java:97)
       at org.gradle.internal.operations.DelegatingBuildOperationExecutor.run(DelegatingBuildOperationExecutor.java:31)
       at org.gradle.api.internal.tasks.execution.EventFiringTaskExecuter.execute(EventFiringTaskExecuter.java:46)
       at org.gradle.execution.taskgraph.DefaultTaskExecutionGraph$ExecuteTaskAction.execute(DefaultTaskExecutionGraph.java:262)
       at org.gradle.execution.taskgraph.DefaultTaskExecutionGraph$ExecuteTaskAction.execute(DefaultTaskExecutionGraph.java:246)
       at org.gradle.execution.taskgraph.DefaultTaskPlanExecutor$TaskExecutorWorker$1.execute(DefaultTaskPlanExecutor.java:136)
       at org.gradle.execution.taskgraph.DefaultTaskPlanExecutor$TaskExecutorWorker$1.execute(DefaultTaskPlanExecutor.java:130)
       at org.gradle.execution.taskgraph.DefaultTaskPlanExecutor$TaskExecutorWorker.execute(DefaultTaskPlanExecutor.java:201)
       at org.gradle.execution.taskgraph.DefaultTaskPlanExecutor$TaskExecutorWorker.executeWithTask(DefaultTaskPlanExecutor.java:192)
       at org.gradle.execution.taskgraph.DefaultTaskPlanExecutor$TaskExecutorWorker.run(DefaultTaskPlanExecutor.java:130)
       at org.gradle.internal.concurrent.ExecutorPolicy$CatchAndRecordFailures.onExecute(ExecutorPolicy.java:63)
       at org.gradle.internal.concurrent.ManagedExecutorImpl$1.run(ManagedExecutorImpl.java:46)
       at org.gradle.internal.concurrent.ThreadFactoryImpl$ManagedThreadRunnable.run(ThreadFactoryImpl.java:55)
      Caused by: java.lang.NoSuchMethodError: org.gradle.api.publish.maven.internal.publisher.MavenProjectIdentity.getArtifactId()Ljava/lang/String;
       at org.jfrog.gradle.plugin.artifactory.task.helper.TaskHelperPublications.getArtifactDeployDetails(TaskHelperPublications.java:220)
       at org.jfrog.gradle.plugin.artifactory.task.helper.TaskHelperPublications.collectDescriptorsAndArtifactsForUpload(TaskHelperPublications.java:152)
       at org.jfrog.gradle.plugin.artifactory.task.ArtifactoryTask.collectDescriptorsAndArtifactsForUpload(ArtifactoryTask.java:77)
       at org.jfrog.gradle.plugin.artifactory.task.BuildInfoBaseTask.prepareAndDeploy(BuildInfoBaseTask.java:385)
       at org.jfrog.gradle.plugin.artifactory.task.BuildInfoBaseTask.collectProjectBuildInfo(BuildInfoBaseTask.java:126)
       at org.gradle.internal.reflect.JavaMethod.invoke(JavaMethod.java:73)
       at org.gradle.api.internal.project.taskfactory.StandardTaskAction.doExecute(StandardTaskAction.java:46)
       at org.gradle.api.internal.project.taskfactory.StandardTaskAction.execute(StandardTaskAction.java:39)
       at org.gradle.api.internal.project.taskfactory.StandardTaskAction.execute(StandardTaskAction.java:26)
       at org.gradle.api.internal.AbstractTask$TaskActionWrapper.execute(AbstractTask.java:794)
       at org.gradle.api.internal.AbstractTask$TaskActionWrapper.execute(AbstractTask.java:761)
       at org.gradle.api.internal.tasks.execution.ExecuteActionsTaskExecuter$1.run(ExecuteActionsTaskExecuter.java:131)
       at org.gradle.internal.operations.DefaultBuildOperationExecutor$RunnableBuildOperationWorker.execute(DefaultBuildOperationExecutor.java:317)
       at org.gradle.internal.operations.DefaultBuildOperationExecutor$RunnableBuildOperationWorker.execute(DefaultBuildOperationExecutor.java:309)
       at org.gradle.internal.operations.DefaultBuildOperationExecutor.execute(DefaultBuildOperationExecutor.java:185)
       at org.gradle.internal.operations.DefaultBuildOperationExecutor.run(DefaultBuildOperationExecutor.java:97)
       at org.gradle.internal.operations.DelegatingBuildOperationExecutor.run(DelegatingBuildOperationExecutor.java:31)
       at org.gradle.api.internal.tasks.execution.ExecuteActionsTaskExecuter.executeAction(ExecuteActionsTaskExecuter.java:120)
       at org.gradle.api.internal.tasks.execution.ExecuteActionsTaskExecuter.executeActions(ExecuteActionsTaskExecuter.java:99)
       ... 31 more

       

        Attachments

          Activity

            People

            Assignee:
            eyalb Eyal Ben Moshe
            Reporter:
            edeandrea Eric Deandrea (Inactive)
            Votes:
            0 Vote for this issue
            Watchers:
            1 Start watching this issue

              Dates

              Created:
              Updated: