Uploaded image for project: 'Jenkins Artifactory Plug-in'
  1. Jenkins Artifactory Plug-in
  2. HAP-731

Failed to deploy file: HTTP response code: 401. HTTP response message: Unauthorized

    XMLWordPrintable

    Details

      Description

      artifactory publish failure. 401

      Deploying artifact: http://1234.com/artifactory/dma-libs-release-local/com/pason/java-dma-messaging/1.0.1-160418.152457/java-dma-messaging-1.0.1-160418.152457.pom
      :artifactoryPublish FAILED

      FAILURE: Build failed with an exception.

      • What went wrong:
        Execution failed for task ':artifactoryPublish'.
        > java.io.IOException: Failed to deploy file: HTTP response code: 401. HTTP response message: Unauthorized
      • Try:
        Run with --info or --debug option to get more log output.
      • Exception is:
        org.gradle.api.tasks.TaskExecutionException: Execution failed for task ':artifactoryPublish'.
        at org.gradle.api.internal.tasks.execution.ExecuteActionsTaskExecuter.executeActions(ExecuteActionsTaskExecuter.java:69)
        at org.gradle.api.internal.tasks.execution.ExecuteActionsTaskExecuter.execute(ExecuteActionsTaskExecuter.java:46)
        at org.gradle.api.internal.tasks.execution.PostExecutionAnalysisTaskExecuter.execute(PostExecutionAnalysisTaskExecuter.java:35)
        at org.gradle.api.internal.tasks.execution.SkipUpToDateTaskExecuter.execute(SkipUpToDateTaskExecuter.java:64)
        at org.gradle.api.internal.tasks.execution.ValidatingTaskExecuter.execute(ValidatingTaskExecuter.java:58)
        at org.gradle.api.internal.tasks.execution.SkipEmptySourceFilesTaskExecuter.execute(SkipEmptySourceFilesTaskExecuter.java:42)
        at org.gradle.api.internal.tasks.execution.SkipTaskWithNoActionsExecuter.execute(SkipTaskWithNoActionsExecuter.java:52)
        at org.gradle.api.internal.tasks.execution.SkipOnlyIfTaskExecuter.execute(SkipOnlyIfTaskExecuter.java:53)
        at org.gradle.api.internal.tasks.execution.ExecuteAtMostOnceTaskExecuter.execute(ExecuteAtMostOnceTaskExecuter.java:43)
        at org.gradle.api.internal.AbstractTask.executeWithoutThrowingTaskFailure(AbstractTask.java:306)
        at org.gradle.execution.taskgraph.AbstractTaskPlanExecutor$TaskExecutorWorker.executeTask(AbstractTaskPlanExecutor.java:79)
        at org.gradle.execution.taskgraph.AbstractTaskPlanExecutor$TaskExecutorWorker.processTask(AbstractTaskPlanExecutor.java:63)
        at org.gradle.execution.taskgraph.AbstractTaskPlanExecutor$TaskExecutorWorker.run(AbstractTaskPlanExecutor.java:51)
        at org.gradle.execution.taskgraph.DefaultTaskPlanExecutor.process(DefaultTaskPlanExecutor.java:23)
        at org.gradle.execution.taskgraph.DefaultTaskGraphExecuter.execute(DefaultTaskGraphExecuter.java:88)
        at org.gradle.execution.SelectedTaskExecutionAction.execute(SelectedTaskExecutionAction.java:29)
        at org.gradle.execution.DefaultBuildExecuter.execute(DefaultBuildExecuter.java:62)
        at org.gradle.execution.DefaultBuildExecuter.access$200(DefaultBuildExecuter.java:23)
        at org.gradle.execution.DefaultBuildExecuter$2.proceed(DefaultBuildExecuter.java:68)
        at org.gradle.execution.DryRunBuildExecutionAction.execute(DryRunBuildExecutionAction.java:32)
        at org.gradle.execution.DefaultBuildExecuter.execute(DefaultBuildExecuter.java:62)
        at org.gradle.execution.DefaultBuildExecuter.execute(DefaultBuildExecuter.java:55)
        at org.gradle.initialization.DefaultGradleLauncher.doBuildStages(DefaultGradleLauncher.java:149)
        at org.gradle.initialization.DefaultGradleLauncher.doBuild(DefaultGradleLauncher.java:106)
        at org.gradle.initialization.DefaultGradleLauncher.run(DefaultGradleLauncher.java:86)
        at org.gradle.launcher.exec.InProcessBuildActionExecuter$DefaultBuildController.run(InProcessBuildActionExecuter.java:80)
        at org.gradle.launcher.cli.ExecuteBuildAction.run(ExecuteBuildAction.java:33)
        at org.gradle.launcher.cli.ExecuteBuildAction.run(ExecuteBuildAction.java:24)
        at org.gradle.launcher.exec.InProcessBuildActionExecuter.execute(InProcessBuildActionExecuter.java:36)
        at org.gradle.launcher.exec.InProcessBuildActionExecuter.execute(InProcessBuildActionExecuter.java:26)
        at org.gradle.launcher.cli.RunBuildAction.run(RunBuildAction.java:51)
        at org.gradle.internal.Actions$RunnableActionAdapter.execute(Actions.java:169)
        at org.gradle.launcher.cli.CommandLineActionFactory$ParseAndBuildAction.execute(CommandLineActionFactory.java:237)
        at org.gradle.launcher.cli.CommandLineActionFactory$ParseAndBuildAction.execute(CommandLineActionFactory.java:210)
        at org.gradle.launcher.cli.JavaRuntimeValidationAction.execute(JavaRuntimeValidationAction.java:35)
        at org.gradle.launcher.cli.JavaRuntimeValidationAction.execute(JavaRuntimeValidationAction.java:24)
        at org.gradle.launcher.cli.CommandLineActionFactory$WithLogging.execute(CommandLineActionFactory.java:206)
        at org.gradle.launcher.cli.CommandLineActionFactory$WithLogging.execute(CommandLineActionFactory.java:169)
        at org.gradle.launcher.cli.ExceptionReportingAction.execute(ExceptionReportingAction.java:33)
        at org.gradle.launcher.cli.ExceptionReportingAction.execute(ExceptionReportingAction.java:22)
        at org.gradle.launcher.Main.doAction(Main.java:33)
        at org.gradle.launcher.bootstrap.EntryPoint.run(EntryPoint.java:45)
        at org.gradle.launcher.bootstrap.ProcessBootstrap.runNoExit(ProcessBootstrap.java:54)
        at org.gradle.launcher.bootstrap.ProcessBootstrap.run(ProcessBootstrap.java:35)
        at org.gradle.launcher.GradleMain.main(GradleMain.java:23)
        at org.gradle.wrapper.BootstrapMainStarter.start(BootstrapMainStarter.java:30)
        at org.gradle.wrapper.WrapperExecutor.execute(WrapperExecutor.java:127)
        at org.gradle.wrapper.GradleWrapperMain.main(GradleWrapperMain.java:61)
        Caused by: org.gradle.internal.UncheckedException: java.io.IOException: Failed to deploy file: HTTP response code: 401. HTTP response message: Unauthorized
        at org.gradle.internal.UncheckedException.throwAsUncheckedException(UncheckedException.java:39)
        at org.gradle.internal.reflect.JavaMethod.invoke(JavaMethod.java:66)
        at org.gradle.api.internal.project.taskfactory.AnnotationProcessingTaskFactory$StandardTaskAction.doExecute(AnnotationProcessingTaskFactory.java:218)
        at org.gradle.api.internal.project.taskfactory.AnnotationProcessingTaskFactory$StandardTaskAction.execute(AnnotationProcessingTaskFactory.java:211)
        at org.gradle.api.internal.project.taskfactory.AnnotationProcessingTaskFactory$StandardTaskAction.execute(AnnotationProcessingTaskFactory.java:200)
        at org.gradle.api.internal.AbstractTask$TaskActionWrapper.execute(AbstractTask.java:585)
        at org.gradle.api.internal.AbstractTask$TaskActionWrapper.execute(AbstractTask.java:568)
        at org.gradle.api.internal.tasks.execution.ExecuteActionsTaskExecuter.executeAction(ExecuteActionsTaskExecuter.java:80)
        at org.gradle.api.internal.tasks.execution.ExecuteActionsTaskExecuter.executeActions(ExecuteActionsTaskExecuter.java:61)
        ... 47 more
        Caused by: java.io.IOException: Failed to deploy file: HTTP response code: 401. HTTP response message: Unauthorized
        at org.jfrog.build.client.ArtifactoryBuildInfoClient.throwHttpIOException(ArtifactoryBuildInfoClient.java:647)
        at org.jfrog.build.client.ArtifactoryBuildInfoClient.uploadFile(ArtifactoryBuildInfoClient.java:529)
        at org.jfrog.build.client.ArtifactoryBuildInfoClient.deployArtifact(ArtifactoryBuildInfoClient.java:299)
        at org.jfrog.gradle.plugin.artifactory.task.BuildInfoBaseTask.deployArtifacts(BuildInfoBaseTask.java:411)
        at org.jfrog.gradle.plugin.artifactory.task.BuildInfoBaseTask.prepareAndDeploy(BuildInfoBaseTask.java:287)
        at org.jfrog.gradle.plugin.artifactory.task.BuildInfoBaseTask.collectProjectBuildInfo(BuildInfoBaseTask.java:365)
        at org.gradle.internal.reflect.JavaMethod.invoke(JavaMethod.java:63)
        ... 54 more

        Attachments

          Activity

            People

            Assignee:
            eyalbe Eyal Ben David
            Reporter:
            adelanre Lanre (Inactive)
            Votes:
            2 Vote for this issue
            Watchers:
            3 Start watching this issue

              Dates

              Created:
              Updated: